آینه کاو
preferred label: concave mirror @en
type: Concept
narrower: آینه هم‌گرا

آینه هم‌گرا
scope note: آینه‌ای کاو که پرتوهای موازی با محور را هم‌گرا می‌کند.
broader: آینه کاو
preferred label: converging mirror @en
type: Concept