آینه
preferred label: mirror @en
type: Concept
narrower: آینه کوژ

آینه کوژ
scope note: آینه‌ای که سطح بازتابندۀ آن بخش برجستۀ سطحی خمیده است.
narrower: آینه واگرا
broader: آینه
preferred label: convex mirror @en
type: Concept

آینه واگرا
preferred label: diverging mirror @en
type: Concept
broader: آینه کوژ