تلسکوپ بازتابی
preferred label: reflecting telescope @en
type: Concept
related: آینه ثانویه

آینه
preferred label: mirror @en
type: Concept
narrower: آینه ثانویه

آینه ثانویه
scope note: دومین آینه در مسیر پرتوهای نور در تلسکوپ‌های بازتابی
related: تلسکوپ بازتابی
broader: آینه
preferred label: secondary mirror @en
type: Concept