هم‌راستاساز نوری
preferred label: optical collimator @en
type: Concept
narrower: عدسی موازی‌ساز

عدسی موازی‌ساز
scope note: نوعی عدسی که برای موازی ساختن پرتوهای ورودی به سامانۀ نوری به کار می‌رود.
broader: هم‌راستاساز نوری
preferred label: collimating lens @en
type: Concept