منشور پاشان
scope note: منشوری که نور مرکب را به اجزای آن تجزیه کند.
broader: منشور
preferred label: dispersing prism @en
type: Concept

منشور
preferred label: prism @en
type: Concept
narrower: منشور پاشان