ریل
preferred label: rail @en
type: Concept
narrower: ریل آسیب‌دیده

ریل آسیب‌دیده
scope note: ریلی که در نتیجۀ خروج از خط قطار یا بارگیری و جابه‌جایی نادرست یا به‌ دلایل دیگر آسیب دیده باشد.
narrower: ریل تابیده
broader: ریل
preferred label: damaged rail @en
type: Concept

ریل تابیده
preferred label: crippled rail @en
type: Concept
broader: ریل آسیب‌دیده