ریل
preferred label: rail @en
type: Concept
narrower: ریل قاشقی

ریل قاشقی
scope note: ریلی با کلاهک شیاردار که طوقۀ چرخ‌های خط‌نورد در آن قرار می‌گیرد.
broader: ریل
preferred label: grooved rail @en
type: Concept