ریل
preferred label: rail @en
type: Concept
narrower: ریل بلند

ریل بلند
scope note: نوعی ریل که طول آن بیش از طول ریل استاندارد است و در خطوط سریع‌السیر به کار می‌رود.
broader: ریل
preferred label: long rail @en
type: Concept