ریل
preferred label: rail @en
type: Concept
narrower: ریل بالی

ریل بالی
scope note: قطعه‌ریل کوتاهی با انتهای زاویه‌دار که در تکۀ مرکزی سوزن برای هدایت‌ چرخ نصب می‌شود.
broader: ریل
preferred label: wing rail @en
type: Concept