خشک‌کن نقاله‌ای
preferred label: conveyor dryer @en
type: Concept
narrower: خشک‌کن نقاله‌ای ناهم‌سو

خشک‌کن نقاله‌ای ناهم‌سو
scope note: نوعی خشک‌کن نقاله‌ای که در آن جهت حرکت تسمه‌نقالۀ حاوی مواد غذایی در خلاف جهت جریان هوای گرم است.
broader: خشک‌کن نقاله‌ای
preferred label: countercurrent conveyor dryer @en
type: Concept