خشک‌کن بادی
preferred label: pneumatic dryer @en
type: Concept
narrower: خشک‌کن هواراند

خشک‌کن هواراند
scope note: نوعی خشک‌کن بادی که در آن مواد غذایی در جریان هوای گرم در داخل ستونی عمودی معلق می‌شوند و پس از خشک شدن به مخزن دستگاه منتقل می‌شوند.
broader: خشک‌کن بادی
preferred label: air-lift dryer @en
type: Concept