حفاظ‌گذاری دی‌الکتریکی
scope note: کاهش دادن میدان الکتریکی در ناحیه‌ای از فضا با وارد کردن مادۀ دی‌الکتریکی
broader: سپرگذاری
preferred label: dielectric shielding @en
type: Concept

سپرگذاری
preferred label: shielding @en
type: Concept
narrower: حفاظ‌گذاری دی‌الکتریکی