لنگر
preferred label: anchor @en
type: Concept
narrower: لنگر پاشنه

لنگر پاشنه
scope note: نوعی لنگر بی‌شانه که وزن آن حدود یک‌چهارم وزن لنگر سینه است و از آن در آبراه‌ها و مناطق باریک که امکان جولان و چرخش محدود است استفاده می‌کنند.
broader: لنگر
preferred label: stern anchor @en
type: Concept