سکان جلومحور
scope note: سکانی که محور آن جلو تیغۀ سکان قرار دارد.
broader: سکان
preferred label: unbalanced rudder @en
type: Concept

سکان
preferred label: rudder @en
type: Concept
narrower: سکان جلومحور