چکش
preferred label: hammer @en
type: Concept
narrower: چکش نشانه‌گذاری

چکش نشانه‌گذاری
scope note: چکشی برای نشانه‌گذاری درختان که طرح مشخصی از اعداد و حروف دارد که به‌وسیلۀ سازمان جنگل‌ها تعیین شده است.
broader: چکش
preferred label: marking hammer @en
type: Concept