شیشه جلو
preferred label: windshield @en
type: Concept
narrower: شیشۀ جلوی چندلایه

شیشۀ جلوی چندلایه
scope note: شیشۀ جلویی که از دو لایه شیشه و یک لایه بسپار میانی تشکیل شده است و در هنگام شکستن ریزش نمی‌کند.
broader: شیشه جلو
preferred label: laminated windshield @en
type: Concept