باند ساده
scope note: باند پرواز فاقد تجهیزات کمک‌ناوبری و فقط دارای علائم مقررات پرواز با دید، شامل خط‌کشی یا پیکان‌های وسط و شمارۀ سمت و در صورت لزوم آستانۀ جابه‌جاشده
broader: باند پرواز فرودگاه
preferred label: basic runway @en
type: Concept

باند پرواز فرودگاه
preferred label: airport runway @en
type: Concept
narrower: باند ساده