باند شیاردار
scope note: باندی که بر سطح آن شیارهایی استاندارد تعبیه شده است تا در هنگام بارندگی‌های شدید از غرقاب شدن آن جلوگیری شود.
broader: باند پرواز فرودگاه
preferred label: grooved runway @en
type: Concept

باند پرواز فرودگاه
preferred label: airport runway @en
type: Concept
narrower: باند شیاردار