باند اصلی
scope note: باندی در فرودگاه که بیشتر مورد استفاده قرار می‌گیرد و معمولاً نسبت به باندهای دیگر طول بیشتری دارد.
broader: باند پرواز فرودگاه
preferred label: main runway @en
type: Concept

باند پرواز فرودگاه
preferred label: airport runway @en
type: Concept
narrower: باند اصلی