تسهیلات
preferred label: facilities @en
type: Concept
narrower: موزه

موزه
scope note: محل نگهداری و نمایش آثار باستانی و هنری و مجموعه‌ها و اشیای نفیس
related: افلاک‌نما
broader: تسهیلات
preferred label: museum @en
type: Concept

افلاک‌نما
preferred label: planetarium @en
type: Concept
related: موزه