انبار گمرک
scope note: انباری که در آن کالاهای وارداتی تا انجام امور گمرکی و دریافت اجازۀ ترخیص نگهداری می‌شود.
broader: انبار
preferred label: bonded warehouse @en
type: Concept

انبار
preferred label: warehouse @en
type: Concept
narrower: انبار گمرک