هزینه
preferred label: cost @en
type: Concept
narrower: هزینه کیفیت

هزینه کیفیت
scope note: هزینه‌ای که برای رسیدن به کیفیت موردنظر صرف می‌شود و معمولاً مشتمل بر هزینۀ برنامه‌ریزی و واپایش و تضمین کیفیت است.
broader: هزینه
preferred label: cost of quality @en
type: Concept