هزینه
preferred label: cost @en
type: Concept
narrower: هزینه غیرمستقیم

هزینه غیرمستقیم
scope note: هزینه‌ای که به‌طور مشترک برای انجام فعالیت‌های مختلف اما در قالب یک پروژه صرف شود.
broader: هزینه
preferred label: indirect cost @en
type: Concept