طغیان همراه‌بری افشانه‌ای
scope note: طغیان ناشی از همراه‌بری قطره‌های مایع به‌حدی‌که مایع به جای جاری شدن به سمت سینی پایینی به‌صورت افشانه‌ای به سینی بالایی راه یابد.
broader: طغیان همراه‌بری
preferred label: spray entrainment flooding @en
type: Concept

طغیان همراه‌بری
preferred label: entrainment flooding @en
type: Concept
narrower: طغیان همراه‌بری افشانه‌ای