پیش‌بینی هوا
preferred label: weather forecasting @en
type: Concept
narrower: پیش‌بینی پایایی

پیش‌بینی پایایی
scope note: نوعی پیش‌بینی که بر مبنای آن شرایط جوّی کنونی تا زمان معینی در آینده ادامه خواهد داشت.
broader: پیش‌بینی هوا
preferred label: persistence forecast @en
type: Concept