جنگل‌داری پهنه‌ور
scope note: عملیات جنگل‌داری بر پایۀ کار کم و سرمایه‌گذاری نازل در واحد سطح
broader: جنگل‌داری
preferred label: extensive forestry @en
type: Concept

جنگل‌داری
preferred label: forestry @en
type: Concept
narrower: جنگل‌داری پهنه‌ور