جنگل‌داری
preferred label: forestry @en
type: Concept
narrower: جنگل‌داری مشارکتی

جنگل‌داری مشارکتی
scope note: نوعی مدیریت جنگل با مشارکت افراد و گروه‌های ذی‌نفع در مراحل برنامه‌ریزی و اجرا
broader: جنگل‌داری
preferred label: participatory forestry @en
type: Concept