بسامد بهنجار
scope note: بسامد ارتعاش‌های طبیعی هر سامانه یا سازه
broader: بسامد
preferred label: normal frequency @en
type: Concept

بسامد
preferred label: frequency @en
type: Concept
narrower: بسامد بهنجار