تغذیه
preferred label: nutrition @en
type: Concept
narrower: تغذیه شیرخوارگی

تغذیه شیرخوارگی
scope note: رژیمی غذایی برای برآوردن نیازهای تغذیه‌ای از لحظۀ تولد تا یک‌سالگی
broader: تغذیه
preferred label: infant nutrition @en
type: Concept