فن بازپخت مهره‌ای
scope note: روشی که در آن جوش لایۀ رویی موجب پخت مجدد و اصلاح خواص متالورژیکی لایۀ زیرین می‌شود.
broader: بازپخت
preferred label: temper bead technique @en
type: Concept

بازپخت
preferred label: tempering @en
type: Concept
narrower: فن بازپخت مهره‌ای