تصویربرداری پرتونگاشتی
scope note: نوعی تصویربرداری براساس تضعیف تفریقی عبور اشعۀ ایکس
broader: فن تصویربرداری
preferred label: radiographic imaging @en
type: Concept

فن تصویربرداری
preferred label: imaging technique @en
type: Concept
narrower: تصویربرداری پرتونگاشتی