آبیاری
preferred label: irrigation @en
type: Concept
narrower: آبیاری قطع‌ووصلی

آبیاری قطع‌ووصلی
scope note: نوعی آبیاری جویچه‌ای که در آن، جریان ورودی آب به داخل جویچه براساس برنامۀ زمان‌بندی‌شده و به‌صورت ماشینی قطع‌ووصل می‌شود.
broader: آبیاری
preferred label: surge irrigation @en
type: Concept