زبان‌شناسی مقابله‌ای
scope note: شاخه‌ای از زبان‌شناسی که وظیفۀ آن تعیین تفاوت‌ها و شباهت‌های زبانی دو زبان در سطوح آوایی و صرفی و نحوی و مانند آنهاست.
broader: زبان‌شناسی
preferred label: contrastive linguistics @en
type: Concept

زبان‌شناسی
preferred label: linguistics @en
type: Concept
narrower: زبان‌شناسی مقابله‌ای