زبان‌شناسی درزمانی
alternative label: زبان‌شناسی تاریخی
scope note: شاخه‌ای از زبان‌شناسی که به مطالعۀ تغییرات زبان در طول زمان می‌پردازد.
broader: زبان‌شناسی
preferred label: diachronic linguistics @en
type: Concept

زبان‌شناسی
preferred label: linguistics @en
type: Concept
narrower: زبان‌شناسی درزمانی