زبان‌شناسی فلسفی
scope note: شاخه‌ای از زبان‌شناسی که از یک‌سو به بررسی نقش زبان در درک مسائل فلسفی و از سوی دیگر به وضعیت فلسفی نظریه‌ها و روش‌ها و مشاهدات زبانی می‌پردازد.
broader: زبان‌شناسی
preferred label: philosophical linguistics @en
type: Concept

زبان‌شناسی
preferred label: linguistics @en
type: Concept
narrower: زبان‌شناسی فلسفی