بازرسی
preferred label: inspection @en
type: Concept
narrower: بازرسی با مایع نافذ

بازرسی با مایع نافذ
scope note: نوعی آزمون غیرمخرب برای آشکارسازی ناپیوستگی‌های سطح در آن که با به‌کارگیری مایع نفوذکننده و برداشتن مازاد آن، حفره‌ها و ترک‌ها با استفاده از مواد ظاهرکننده یا بیرون‌کشنده مشخص می‌شوند.
broader: بازرسی
preferred label: liquid-penetrant inspection @en
type: Concept