بازرسی
preferred label: inspection @en
type: Concept
narrower: بازرسی پرتونگاشتی

بازرسی پرتونگاشتی
scope note: آشکارسازی یا تشخیص ناپیوستگی‌های ماده و هم‌چنین تعیین توزیع یا عمق خوردگی با استفاده از پرتوهای ایکس یا تابش هسته‌ای
broader: بازرسی
preferred label: radiographic inspection @en
type: Concept