واسط (رایانه)
preferred label: interface (computer) @en
type: Concept
narrower: میانای کارکردی

میانای کارکردی
scope note: میانایی که فقط یک روش انتزاعی دارد و معمولاً فقط یک عمل انجام می‌دهد.
broader: واسط (رایانه)
preferred label: functional interface @en
type: Concept