اینترنت
preferred label: internet @en
type: Concept
narrower: سامانه نام دامنه

سامانه نام دامنه
alternative label: ساناد
scope note: سامانه‌ای اینترنتی که نام‌های دامنه را به نشانی‌هایی در قالب قرارداد اینترنت برمی‌گردانَد.
broader: اینترنت
preferred label: domain name system @en
type: Concept