لاک
preferred label: lacquer @en
type: Concept
narrower: لاک‌الکل

لاک‌الکل
scope note: لاکی که از حل کردن رزین‌ها در الکل صنعتی به دست می‌آید.
broader: لاک
preferred label: spirit lacquer @en
type: Concept