فشرده‌ساز مرکزگریز
scope note: نوعی فشرده‌ساز در موتورهای توربین گازی با پروانه‌های پیچی
broader: فشرده‌ساز
preferred label: centrifugal flow compressor @en
type: Concept

فشرده‌ساز
preferred label: compressor @en
type: Concept
narrower: فشرده‌ساز مرکزگریز