میل‌ پروانه
scope note: بخش انتهایی محور انتقال نیرو از موتور که پروانه به آن متصل است.
broader: محور (اجزای ماشین)
preferred label: propeller shaft @en
type: Concept

محور (اجزای ماشین)
preferred label: shaft (machine components) @en
type: Concept
narrower: میل‌ پروانه