مدیریت
preferred label: management @en
type: Concept
narrower: مدیریت سامانه‌های حمل‌ونقل

مدیریت سامانه‌های حمل‌ونقل
scope note: مجموعه تدابیر و برنامه‌های کم‌هزینۀ بهبود سامانۀ حمل‌ونقل برای رسیدن به کارایی مطلوب
broader: مدیریت
preferred label: transportation systems management @en
type: Concept