نقشه
preferred label: map @en
type: Concept
narrower: نقشه اختصاصی

نقشه اختصاصی
scope note: نقشه‌ای که به سفارش یک شرکت یا سازمان خاص برای مقاصد خاص تهیه می‌شود.
broader: نقشه
preferred label: arbitrary map @en
type: Concept