نقشه
preferred label: map @en
type: Concept
narrower: نقشه زیست‌اقلیمی

نقشه زیست‌اقلیمی
scope note: نمایش توزیع داده‌های زیست‌اقلیمی در یک ناحیۀ معین و معمولاً وسیع کرۀ زمین
broader: نقشه
preferred label: bioclimatic map @en
type: Concept