نقشه
preferred label: map @en
type: Concept
narrower: نقشه هم‌مقدار

نقشه هم‌مقدار
scope note: نقشه‌ای که در آن نقاط هم‌کمیت به ‌هم وصل شده‌اند.
broader: نقشه
preferred label: isoplethic map @en
type: Concept