نقشه
preferred label: map @en
type: Concept
narrower: نقشه ایستا

نقشه ایستا
scope note: نقشه‌ای که اطلاعات مربوط به یک زمان مشخص را ارائه می‌دهد.
broader: نقشه
preferred label: static map @en
type: Concept