رواناب
preferred label: runoff @en
type: Concept
narrower: رواناب سطحی

رواناب سطحی
scope note: بخشی از رواناب که بر سطح زمین جاری می‌شود و به نزدیک‌ترین مجرای پذیرنده وارد می‌شود.
broader: رواناب
preferred label: surface runoff @en
type: Concept