بازدارنده اسیدی
scope note: نوعی بازدارندۀ خوردگی غالباً از جنس مواد آلی حاوی نیتروژن و گوگرد و دارای بار قطبی که جذب سطح فلز می‌شود و از حملۀ اسید به سطح عریان فلز در هنگام پوسته‌زدایی (descaling) محافظت می‌کند.
related: جرم‌زدایی
broader: بازدارنده خوردگی
preferred label: acid inhibitor @en
type: Concept

جرم‌زدایی
preferred label: descaling @en
type: Concept
related: بازدارنده اسیدی

بازدارنده خوردگی
preferred label: corrosion inhibitor @en
type: Concept
narrower: بازدارنده اسیدی