عامل
preferred label: agent @en
type: Concept
narrower: عامل ترشوندگی

عامل ترشوندگی
scope note: ترکیبی که تماس مایع و سطح جامد را با کاهش کشش سطحی بهبود می‌بخشد.
broader: عامل
preferred label: wetting agent @en
type: Concept